Reaction Details
TargetReceptor-interacting serine/threonine-protein kinase 1
LigandBDBM50159509
Substrate/Competitorn/a
Meas. Tech.ChEBML_1569442
IC50>10000±n/a nM
Citation Harris, PAKing, BWBandyopadhyay, DBerger, SBCampobasso, NCapriotti, CACox, JADare, LDong, XFinger, JNGrady, LCHoffman, SJJeong, JUKang, JKasparcova, VLakdawala, ASLehr, RMcNulty, DENagilla, ROuellette, MTPao, CSRendina, ARSchaeffer, MCSummerfield, JDSwift, BATotoritis, RDWard, PZhang, AZhang, DMarquis, RWBertin, JGough, PJ DNA-Encoded Library Screening Identifies Benzo[b][1,4]oxazepin-4-ones as Highly Potent and Monoselective Receptor Interacting Protein 1 Kinase Inhibitors. J Med Chem59:2163-78 (2016) 
 
Receptor-interacting serine/threonine-protein kinase 1
Name:Receptor-interacting serine/threonine-protein kinase 1
Type:Enzyme Catalytic Domain
Mol. Mass.:75926.99
Organism:Homo sapiens (Human)
Description:Q13546
Residue:671
BDBM50159509
NameBDBM50159509
Synonyms:CHEMBL3787216
TypeSmall organic molecule
Emp. Form.C20H17N3O4
Mol. Mass.363.3667
SMILESO=C(N[C@@H]1COc2ccccc2NC1=O)c1cc(Cc2ccccc2)on1