Reaction Details
TargetReceptor-interacting serine/threonine-protein kinase 1
LigandBDBM50159507
Substrate/Competitorn/a
Meas. Tech.ChEMBL_1569443 (CHEMBL3789105)
IC50 1.6±n/a nM
Citation Harris, PAKing, BWBandyopadhyay, DBerger, SBCampobasso, NCapriotti, CACox, JADare, LDong, XFinger, JNGrady, LCHoffman, SJJeong, JUKang, JKasparcova, VLakdawala, ASLehr, RMcNulty, DENagilla, ROuellette, MTPao, CSRendina, ARSchaeffer, MCSummerfield, JDSwift, BATotoritis, RDWard, PZhang, AZhang, DMarquis, RWBertin, JGough, PJ DNA-Encoded Library Screening Identifies Benzo[b][1,4]oxazepin-4-ones as Highly Potent and Monoselective Receptor Interacting Protein 1 Kinase Inhibitors. J Med Chem59:2163-78 (2016) 
 
Receptor-interacting serine/threonine-protein kinase 1
Name:Receptor-interacting serine/threonine-protein kinase 1
Type:Enzyme Catalytic Domain
Mol. Mass.:75926.99
Organism:Homo sapiens (Human)
Description:Q13546
Residue:671
BDBM50159507
NameBDBM50159507
Synonyms:CHEMBL3785703
TypeSmall organic molecule
Emp. Form.C21H19N3O4
Mol. Mass.377.3933
SMILESCN1c2ccccc2OC[C@H](NC(=O)c2cc(Cc3ccccc3)on2)C1=O