Reaction Details
TargetInduced myeloid leukemia cell differentiation protein Mcl-1
LigandBDBM50159939
Substrate/Competitorn/a
Meas. Tech.ChEBML_1565814
Ki 18±n/a nM
Citation Pelz, NFBian, ZZhao, BShaw, STarr, JCBelmar, JGregg, CCamper, DVGoodwin, CMArnold, ALSensintaffar, JLFriberg, ARossanese, OWLee, TOlejniczak, ETFesik, SW Discovery of 2-Indole-acylsulfonamide Myeloid Cell Leukemia 1 (Mcl-1) Inhibitors Using Fragment-Based Methods. J Med Chem59:2054-66 (2016) 
 
Induced myeloid leukemia cell differentiation protein Mcl-1
Name:Induced myeloid leukemia cell differentiation protein Mcl-1
Type:Membrane; Single-pass membrane protein
Mol. Mass.:37332.87
Organism:Homo sapiens (Human)
Description:Q07820
Residue:350
BDBM50159939
NameBDBM50159939
Synonyms:CHEMBL3786947
TypeSmall organic molecule
Emp. Form.C30H28Cl2F3N3O5S
Mol. Mass.670.527
SMILESCc1cc(OCCCc2c([nH]c3cc(Cl)ccc23)C(=O)NS(=O)(=O)CCNC(=O)c2ccccc2C(F)(F)F)cc(C)c1Cl