Reaction Details
TargetInduced myeloid leukemia cell differentiation protein Mcl-1
LigandBDBM50160064
Substrate/Competitorn/a
Meas. Tech.ChEMBL_1565815 (CHEMBL3789422)
Ki 42±n/a nM
Citation Pelz, NFBian, ZZhao, BShaw, STarr, JCBelmar, JGregg, CCamper, DVGoodwin, CMArnold, ALSensintaffar, JLFriberg, ARossanese, OWLee, TOlejniczak, ETFesik, SW Discovery of 2-Indole-acylsulfonamide Myeloid Cell Leukemia 1 (Mcl-1) Inhibitors Using Fragment-Based Methods. J Med Chem59:2054-66 (2016) 
 
Induced myeloid leukemia cell differentiation protein Mcl-1
Name:Induced myeloid leukemia cell differentiation protein Mcl-1
Type:Membrane; Single-pass membrane protein
Mol. Mass.:37332.87
Organism:Homo sapiens (Human)
Description:Q07820
Residue:350
BDBM50160064
NameBDBM50160064
Synonyms:CHEMBL3786746
TypeSmall organic molecule
Emp. Form.C35H37Cl2N5O5S
Mol. Mass.710.67
SMILESCC(=O)NCc1cccc(c1)S(=O)(=O)NC(=O)c1[nH]c2c(-c3c(C)nn(C)c3C)c(Cl)ccc2c1CCCOc1cc(C)c(Cl)c(C)c1