Reaction Details
TargetInduced myeloid leukemia cell differentiation protein Mcl-1
LigandBDBM50160011
Substrate/Competitorn/a
Meas. Tech.ChEMBL_1565816 (CHEMBL3789423)
Ki 18±n/a nM
Citation Pelz, NFBian, ZZhao, BShaw, STarr, JCBelmar, JGregg, CCamper, DVGoodwin, CMArnold, ALSensintaffar, JLFriberg, ARossanese, OWLee, TOlejniczak, ETFesik, SW Discovery of 2-Indole-acylsulfonamide Myeloid Cell Leukemia 1 (Mcl-1) Inhibitors Using Fragment-Based Methods. J Med Chem59:2054-66 (2016) 
 
Induced myeloid leukemia cell differentiation protein Mcl-1
Name:Induced myeloid leukemia cell differentiation protein Mcl-1
Type:Membrane; Single-pass membrane protein
Mol. Mass.:37332.87
Organism:Homo sapiens (Human)
Description:Q07820
Residue:350
BDBM50160011
NameBDBM50160011
Synonyms:CHEMBL3786622
TypeSmall organic molecule
Emp. Form.C32H29Cl2N3O4S
Mol. Mass.622.561
SMILESCc1cc(OCCCc2c([nH]c3c(c(Cl)ccc23)-c2cccnc2C)C(=O)NS(=O)(=O)c2ccccc2)cc(C)c1Cl