Reaction Details
TargetType-1 angiotensin II receptor A
LigandBDBM50161277
Substrate/Competitorn/a
Meas. Tech.ChEMBL_1566203 (CHEMBL3788344)
Ki 4.3±n/a nM
Citation Bao, XZhu, WZhang, RWen, CWang, LYan, YTang, HChen, Z Synthesis and evaluation of novel angiotensin II receptor 1 antagonists as anti-hypertension drugs. Bioorg Med Chem24:2023-31 (2016) 
 
Type-1 angiotensin II receptor A
Name:Type-1 angiotensin II receptor A
Type:Enzyme Catalytic Domain
Mol. Mass.:40910.53
Organism:RAT
Description:ANGIOTENSIN AT1 AGTR1 RAT::P25095
Residue:359
BDBM50161277
NameBDBM50161277
Synonyms:CHEMBL3787050
TypeSmall organic molecule
Emp. Form.C23H23ClN4O3
Mol. Mass.438.907
SMILESCCCCc1nc(Cl)c(CO)n1Cc1ccc(cc1)-c1ccccc1-c1noc(=O)[nH]1