Reaction Details
TargetDual specificity tyrosine-phosphorylation-regulated kinase 1A
LigandBDBM50161397
Substrate/Competitorn/a
Meas. Tech.ChEMBL_1567130 (CHEMBL3787887)
IC50 9000±n/a nM
Citation Ouach, ABoulahjar, RVala, CBourg, SBonnet, PGuguen-Guillouzo, CRavache, MLe Guevel, RLozach, OLazar, STroin, YMeijer, LRuchaud, SAkssira, MGuillaumet, GRoutier, S Novel optimization of valmerins (tetrahydropyrido[1,2-a]isoindolones) as potent dual CDK5/GSK3 inhibitors. Eur J Med Chem115:311-25 (2016) 
 
Dual specificity tyrosine-phosphorylation-regulated kinase 1A
Name:Dual specificity tyrosine-phosphorylation-regulated kinase 1A
Type:Enzyme
Mol. Mass.:85616.61
Organism:Homo sapiens (Human)
Description:Q13627
Residue:763
BDBM50161397
NameBDBM50161397
Synonyms:CHEMBL3787135
TypeSmall organic molecule
Emp. Form.C22H20N4O2
Mol. Mass.372.4198
SMILESO=C(Nc1ccc2ccccc2n1)Nc1cccc2C(=O)N3CCCCC3c12