Reaction Details
TargetProteasome subunit beta type-5
LigandBDBM50163687
Substrate/Competitorn/a
Meas. Tech.ChEMBL_1572440 (CHEMBL3796231)
IC50 0.760000±n/a nM
Citation Lei, MFeng, HWang, CLi, HShi, JWang, JLiu, ZChen, SHu, SZhu, Y 3D-QSAR-aided design, synthesis, in vitro and in vivo evaluation of dipeptidyl boronic acid proteasome inhibitors and mechanism studies. Bioorg Med Chem24:2576-88 (2016) 
 
Proteasome subunit beta type-5
Name:Proteasome subunit beta type-5
Type:Protein
Mol. Mass.:28480.96
Organism:Homo sapiens (Human)
Description:n/a
Residue:263
BDBM50163687
NameBDBM50163687
Synonyms:CHEMBL3793848
TypeSmall organic molecule
Emp. Form.C35H47BN2O4
Mol. Mass.570.57
SMILES[H][C@@]12C[C@@]([H])(C1(C)C)[C@]1(C)OB(OC1C2)[C@H](CC(C)C)NC(=O)[C@H](Cc1ccccc1)NC(=O)c1cccc2CCCCc12