Reaction Details
TargetProtease
LigandBDBM50163737
Substrate/Competitorn/a
Meas. Tech.ChEMBL_1576370 (CHEMBL3802587)
Ki 1.7±n/a nM
Citation Zhan, PPannecouque, CDe Clercq, ELiu, X Anti-HIV Drug Discovery and Development: Current Innovations and Future Trends. J Med Chem59:2849-78 (2016) 
 
Protease
Name:Protease
Synonyms:n/a
Type:Enzyme
Mol. Mass.:10904.79
Organism:Human immunodeficiency virus 1 (HIV-1)
Description:Q9YQ12
Residue:99
BDBM50163737
NameBDBM50163737
Synonyms:CHEMBL3799941
TypeSmall organic molecule
Emp. Form.C33H39N5O7S
Mol. Mass.649.757
SMILESCOc1ccc(cc1)S(=O)(=O)N(CC(C)C)[C@@H](O)[C@H](Cc1ccccc1)n1cc(COC(=O)N[C@H]2Cc3ccccc3[C@H]2O)nn1