Reaction Details
TargetTransmembrane domain-containing protein TMIGD3
LigandBDBM50163881
Substrate/Competitorn/a
Meas. Tech.ChEMBL_1573808 (CHEMBL3803229)
Ki 343±n/a nM
Citation Tosh, DKCiancetta, AWarnick, EO'Connor, RChen, ZGizewski, ECrane, SGao, ZGAuchampach, JASalvemini, DJacobson, KA Purine (N)-Methanocarba Nucleoside Derivatives Lacking an Exocyclic Amine as Selective A3 Adenosine Receptor Agonists. J Med Chem59:3249-63 (2016) 
 
Transmembrane domain-containing protein TMIGD3
Name:Transmembrane domain-containing protein TMIGD3
Type:PROTEIN
Mol. Mass.:30335.79
Organism:Homo sapiens (Human)
Description:ChEMBL_114868
Residue:266
BDBM50163881
NameBDBM50163881
Synonyms:CHEMBL3798963
TypeSmall organic molecule
Emp. Form.C20H19N7O3
Mol. Mass.405.41
SMILES[H][C@]12C[C@]1([C@@H](O)[C@@H](O)[C@@H]2n1cnc2c(C)nc(nc12)C#Cc1cnccn1)C(=O)NC