Reaction Details
TargetTransmembrane domain-containing protein TMIGD3
LigandBDBM50163882
Substrate/Competitorn/a
Meas. Tech.ChEMBL_1573808 (CHEMBL3803229)
Ki 305±n/a nM
Citation Tosh, DKCiancetta, AWarnick, EO'Connor, RChen, ZGizewski, ECrane, SGao, ZGAuchampach, JASalvemini, DJacobson, KA Purine (N)-Methanocarba Nucleoside Derivatives Lacking an Exocyclic Amine as Selective A3 Adenosine Receptor Agonists. J Med Chem59:3249-63 (2016) 
 
Transmembrane domain-containing protein TMIGD3
Name:Transmembrane domain-containing protein TMIGD3
Type:PROTEIN
Mol. Mass.:30335.79
Organism:Homo sapiens (Human)
Description:ChEMBL_114868
Residue:266
BDBM50163882
NameBDBM50163882
Synonyms:CHEMBL3799095
TypeSmall organic molecule
Emp. Form.C26H29N5O3
Mol. Mass.459.5402
SMILES[H][C@]12C[C@]1([C@@H](O)[C@@H](O)[C@@H]2n1cnc2c(C)nc(nc12)C#Cc1ccc(cc1)C(C)(C)C)C(=O)NC