Reaction Details
TargetPeptidyl-prolyl cis-trans isomerase D
LigandBDBM50164674
Substrate/Competitorn/a
Meas. Tech.ChEMBL_1575776 (CHEMBL3801395)
Kd 34100±n/a nM
Citation Shore, ERAwais, MKershaw, NMGibson, RRPandalaneni, SLatawiec, DWen, LJaved, MACriddle, DNBerry, NO'Neill, PMLian, LYSutton, R Small Molecule Inhibitors of Cyclophilin D To Protect Mitochondrial Function as a Potential Treatment for Acute Pancreatitis. J Med Chem59:2596-611 (2016) 
 
Peptidyl-prolyl cis-trans isomerase D
Name:Peptidyl-prolyl cis-trans isomerase D
Type:Protein
Mol. Mass.:40766.62
Organism:Homo sapiens (Human)
Description:Q08752
Residue:370
BDBM50164674
NameBDBM50164674
Synonyms:CHEMBL3799875
TypeSmall organic molecule
Emp. Form.C14H19N3O4
Mol. Mass.293.3184
SMILESCCOC(=O)CNC(=O)NCc1ccc(NC(C)=O)cc1