Reaction Details
TargetSphingosine 1-phosphate receptor 1
LigandBDBM50164815
Substrate/Competitorn/a
Meas. Tech.ChEMBL_1576115 (CHEMBL3804199)
EC50 1.1±n/a nM
Citation Bolli, MHLescop, CBirker, Mde Kanter, RHess, PKohl, CNayler, ORey, MSieber, PVelker, JWeller, TSteiner, B Novel S1P1 receptor agonists - Part 5: From amino-to alkoxy-pyridines. Eur J Med Chem115:326-41 (2016) 
 
Sphingosine 1-phosphate receptor 1
Name:Sphingosine 1-phosphate receptor 1
Type:Enzyme
Mol. Mass.:42836.02
Organism:Homo sapiens (Human)
Description:P21453
Residue:382
BDBM50164815
NameBDBM50164815
Synonyms:CHEMBL3798969
TypeSmall organic molecule
Emp. Form.C28H36N4O6
Mol. Mass.524.6086
SMILESCCc1cc(cc(OC2CCCC2)n1)-c1nc(no1)-c1cc(C)c(OC[C@@H](O)CNC(=O)CO)c(CC)c1