Reaction Details
TargetSphingosine 1-phosphate receptor 1
LigandBDBM50164820
Substrate/Competitorn/a
Meas. Tech.ChEMBL_1576115 (CHEMBL3804199)
EC50 28±n/a nM
Citation Bolli, MHLescop, CBirker, Mde Kanter, RHess, PKohl, CNayler, ORey, MSieber, PVelker, JWeller, TSteiner, B Novel S1P1 receptor agonists - Part 5: From amino-to alkoxy-pyridines. Eur J Med Chem115:326-41 (2016) 
 
Sphingosine 1-phosphate receptor 1
Name:Sphingosine 1-phosphate receptor 1
Type:Enzyme
Mol. Mass.:42836.02
Organism:Homo sapiens (Human)
Description:P21453
Residue:382
BDBM50164820
NameBDBM50164820
Synonyms:CHEMBL3800496
TypeSmall organic molecule
Emp. Form.C28H30N4O6
Mol. Mass.518.561
SMILESCCc1cc(cc(C)c1OC[C@@H](O)CNC(=O)CO)-c1noc(n1)-c1cc(OC)nc(c1)-c1ccccc1