Reaction Details
TargetSphingosine 1-phosphate receptor 3
LigandBDBM50164811
Substrate/Competitorn/a
Meas. Tech.ChEMBL_1576116 (CHEMBL3804200)
EC50 180±n/a nM
Citation Bolli, MHLescop, CBirker, Mde Kanter, RHess, PKohl, CNayler, ORey, MSieber, PVelker, JWeller, TSteiner, B Novel S1P1 receptor agonists - Part 5: From amino-to alkoxy-pyridines. Eur J Med Chem115:326-41 (2016) 
 
Sphingosine 1-phosphate receptor 3
Name:Sphingosine 1-phosphate receptor 3
Type:G Protein-Coupled Receptor (GPCR)
Mol. Mass.:42278.13
Organism:Homo sapiens (Human)
Description:Q99500
Residue:378
BDBM50164811
NameBDBM50164811
Synonyms:CHEMBL3797486
TypeSmall organic molecule
Emp. Form.C27H36N4O6
Mol. Mass.512.5979
SMILESCCC(CC)c1cc(OC)nc(c1)-c1nc(no1)-c1cc(C)c(OC[C@@H](O)CNC(=O)CO)c(CC)c1