Reaction Details
TargetIntestinal-type alkaline phosphatase
LigandBDBM50165130
Substrate/Competitorn/a
Meas. Tech.ChEMBL_1572749 (CHEMBL3804258)
Ki 29100±n/a nM
Citation al-Rashida, MBatool, GSattar, AEjaz, SAKhan, SLecka, JSévigny, JHameed, AIqbal, J 2-Alkoxy-3-(sulfonylarylaminomethylene)-chroman-4-ones as potent and selective inhibitors of ectonucleotidases. Eur J Med Chem115:484-94 (2016) 
 
Intestinal-type alkaline phosphatase
Name:Intestinal-type alkaline phosphatase
Type:Protein
Mol. Mass.:57094.82
Organism:Bos taurus (Cattle)
Description:P19111
Residue:533
BDBM50165130
NameBDBM50165130
Synonyms:CHEMBL3797595
TypeSmall organic molecule
Emp. Form.C17H15FN2O5S
Mol. Mass.378.375
SMILESCOC1Oc2ccc(F)cc2C(=O)\C1=C/Nc1ccc(cc1)S(N)(=O)=O