Reaction Details
TargetIntestinal-type alkaline phosphatase
LigandBDBM50165139
Substrate/Competitorn/a
Meas. Tech.ChEMBL_1572749 (CHEMBL3804258)
Ki 2770±n/a nM
Citation al-Rashida, MBatool, GSattar, AEjaz, SAKhan, SLecka, JSévigny, JHameed, AIqbal, J 2-Alkoxy-3-(sulfonylarylaminomethylene)-chroman-4-ones as potent and selective inhibitors of ectonucleotidases. Eur J Med Chem115:484-94 (2016) 
 
Intestinal-type alkaline phosphatase
Name:Intestinal-type alkaline phosphatase
Type:Protein
Mol. Mass.:57094.82
Organism:Bos taurus (Cattle)
Description:P19111
Residue:533
BDBM50165139
NameBDBM50165139
Synonyms:CHEMBL3798558
TypeSmall organic molecule
Emp. Form.C18H18N2O5S
Mol. Mass.374.411
SMILESCOC1Oc2ccc(C)cc2C(=O)\C1=C/Nc1cccc(c1)S(N)(=O)=O