Reaction Details
Target5'-nucleotidase
LigandBDBM50165150
Substrate/Competitorn/a
Meas. Tech.ChEMBL_1572755 (CHEMBL3804264)
Ki 64±n/a nM
Citation al-Rashida, MBatool, GSattar, AEjaz, SAKhan, SLecka, JSévigny, JHameed, AIqbal, J 2-Alkoxy-3-(sulfonylarylaminomethylene)-chroman-4-ones as potent and selective inhibitors of ectonucleotidases. Eur J Med Chem115:484-94 (2016) 
 
5'-nucleotidase
Name:5'-nucleotidase
Type:Enzyme
Mol. Mass.:63371.54
Organism:Homo sapiens (Human)
Description:P21589
Residue:574
BDBM50165150
NameBDBM50165150
Synonyms:CHEMBL3799027
TypeSmall organic molecule
Emp. Form.C17H15ClN2O5S
Mol. Mass.394.829
SMILESCOC1Oc2ccc(Cl)cc2C(=O)\C1=C/Nc1ccccc1S(N)(=O)=O