Reaction Details
Target5'-nucleotidase
LigandBDBM50165129
Substrate/Competitorn/a
Meas. Tech.ChEMBL_1572756 (CHEMBL3804265)
Ki 114±n/a nM
Citation al-Rashida, MBatool, GSattar, AEjaz, SAKhan, SLecka, JSévigny, JHameed, AIqbal, J 2-Alkoxy-3-(sulfonylarylaminomethylene)-chroman-4-ones as potent and selective inhibitors of ectonucleotidases. Eur J Med Chem115:484-94 (2016) 
 
5'-nucleotidase
Name:5'-nucleotidase
Type:Enzyme
Mol. Mass.:63971.44
Organism:Rattus norvegicus (Rat)
Description:P21588
Residue:576
BDBM50165129
NameBDBM50165129
Synonyms:CHEMBL3799469
TypeSmall organic molecule
Emp. Form.C17H16N2O5S
Mol. Mass.360.384
SMILESCOC1Oc2ccccc2C(=O)\C1=C/Nc1ccccc1S(N)(=O)=O