Reaction Details
TargetSphingosine 1-phosphate receptor 1
LigandBDBM50165408
Substrate/Competitorn/a
Meas. Tech.ChEMBL_1573233 (CHEMBL3803473)
EC50 4.1±n/a nM
Citation Lescop, CMüller, CMathys, BBirker, Mde Kanter, RKohl, CHess, PNayler, ORey, MSieber, PSteiner, BWeller, TBolli, MH Novel S1P1 receptor agonists - Part 4: Alkylaminomethyl substituted aryl head groups. Eur J Med Chem116:222-238 (2016) 
 
Sphingosine 1-phosphate receptor 1
Name:Sphingosine 1-phosphate receptor 1
Type:Enzyme
Mol. Mass.:42836.02
Organism:Homo sapiens (Human)
Description:P21453
Residue:382
BDBM50165408
NameBDBM50165408
Synonyms:CHEMBL3798240
TypeSmall organic molecule
Emp. Form.C28H38N4O5
Mol. Mass.510.6251
SMILESCCCN(C)Cc1cc(C)cc(c1)-c1nc(no1)-c1cc(C)c(OC[C@@H](O)CNC(=O)CO)c(CC)c1