Reaction Details
TargetSphingosine 1-phosphate receptor 1
LigandBDBM50165410
Substrate/Competitorn/a
Meas. Tech.ChEMBL_1573233 (CHEMBL3803473)
EC50 8.0±n/a nM
Citation Lescop, CMüller, CMathys, BBirker, Mde Kanter, RKohl, CHess, PNayler, ORey, MSieber, PSteiner, BWeller, TBolli, MH Novel S1P1 receptor agonists - Part 4: Alkylaminomethyl substituted aryl head groups. Eur J Med Chem116:222-238 (2016) 
 
Sphingosine 1-phosphate receptor 1
Name:Sphingosine 1-phosphate receptor 1
Type:Enzyme
Mol. Mass.:42836.02
Organism:Homo sapiens (Human)
Description:P21453
Residue:382
BDBM50165410
NameBDBM50165410
Synonyms:CHEMBL3798218
TypeSmall organic molecule
Emp. Form.C26H34N4O5
Mol. Mass.482.572
SMILESCCc1cc(cc(C)c1OC[C@@H](O)CNC(=O)CO)-c1noc(n1)-c1cc(C)cc(CN(C)C)c1