Reaction Details
TargetSphingosine 1-phosphate receptor 1
LigandBDBM50165435
Substrate/Competitorn/a
Meas. Tech.ChEMBL_1573233 (CHEMBL3803473)
EC50 5.1±n/a nM
Citation Lescop, CMüller, CMathys, BBirker, Mde Kanter, RKohl, CHess, PNayler, ORey, MSieber, PSteiner, BWeller, TBolli, MH Novel S1P1 receptor agonists - Part 4: Alkylaminomethyl substituted aryl head groups. Eur J Med Chem116:222-238 (2016) 
 
Sphingosine 1-phosphate receptor 1
Name:Sphingosine 1-phosphate receptor 1
Type:Enzyme
Mol. Mass.:42836.02
Organism:Homo sapiens (Human)
Description:P21453
Residue:382
BDBM50165435
NameBDBM50165435
Synonyms:CHEMBL3799324
TypeSmall organic molecule
Emp. Form.C27H37N5O3
Mol. Mass.479.6144
SMILESCCc1cc(cc(C)c1CCC(=O)NCCO)-c1noc(n1)-c1cnc(N(C)C(C)C)c(CC)c1