Reaction Details
TargetSphingosine 1-phosphate receptor 3
LigandBDBM50165385
Substrate/Competitorn/a
Meas. Tech.ChEMBL_1573232 (CHEMBL3803472)
EC50>10000±n/a nM
Citation Lescop, CMüller, CMathys, BBirker, Mde Kanter, RKohl, CHess, PNayler, ORey, MSieber, PSteiner, BWeller, TBolli, MH Novel S1P1 receptor agonists - Part 4: Alkylaminomethyl substituted aryl head groups. Eur J Med Chem116:222-238 (2016) 
 
Sphingosine 1-phosphate receptor 3
Name:Sphingosine 1-phosphate receptor 3
Type:G Protein-Coupled Receptor (GPCR)
Mol. Mass.:42278.13
Organism:Homo sapiens (Human)
Description:Q99500
Residue:378
BDBM50165385
NameBDBM50165385
Synonyms:CHEMBL3797256
TypeSmall organic molecule
Emp. Form.C28H38N4O5
Mol. Mass.510.6251
SMILESCCc1cc(cc(C)c1OC[C@@H](O)CNC(=O)CO)-c1noc(n1)-c1ccc(CNCC(C)C)c(C)c1