Reaction Details
TargetSphingosine 1-phosphate receptor 3
LigandBDBM50165359
Substrate/Competitorn/a
Meas. Tech.ChEMBL_1573232 (CHEMBL3803472)
EC50 4600±n/a nM
Citation Lescop, CMüller, CMathys, BBirker, Mde Kanter, RKohl, CHess, PNayler, ORey, MSieber, PSteiner, BWeller, TBolli, MH Novel S1P1 receptor agonists - Part 4: Alkylaminomethyl substituted aryl head groups. Eur J Med Chem116:222-238 (2016) 
 
Sphingosine 1-phosphate receptor 3
Name:Sphingosine 1-phosphate receptor 3
Type:G Protein-Coupled Receptor (GPCR)
Mol. Mass.:42278.13
Organism:Homo sapiens (Human)
Description:Q99500
Residue:378
BDBM50165359
NameBDBM50165359
Synonyms:CHEMBL3799109
TypeSmall organic molecule
Emp. Form.C24H32N4O5S
Mol. Mass.488.6
SMILESCCN(C)Cc1ccc(s1)-c1nc(no1)-c1cc(C)c(OC[C@@H](O)CNC(=O)CO)c(CC)c1