Reaction Details
TargetProstaglandin E2 receptor EP3 subtype
LigandBDBM50166574
Substrate/Competitorn/a
Meas. Tech.ChEMBL_1575414 (CHEMBL3802311)
Ki 77±n/a nM
Citation Lee, ECFutatsugi, KArcari, JTBahnck, KCoffey, SBDerksen, DRKalgutkar, ASLoria, PMSharma, R Optimization of amide-based EP3 receptor antagonists. Bioorg Med Chem Lett26:2670-5 (2016) 
 
Prostaglandin E2 receptor EP3 subtype
Name:Prostaglandin E2 receptor EP3 subtype
Type:Enzyme
Mol. Mass.:43335.03
Organism:Homo sapiens (Human)
Description:P43115
Residue:390
BDBM50166574
NameBDBM50166574
Synonyms:CHEMBL3798598
TypeSmall organic molecule
Emp. Form.C16H18N4O2S
Mol. Mass.330.405
SMILESCCN1CCOc2ccc(cc12)C(=O)Nc1nnc(s1)C1CC1