Reaction Details
TargetProstaglandin E2 receptor EP3 subtype
LigandBDBM50166580
Substrate/Competitorn/a
Meas. Tech.ChEMBL_1575414 (CHEMBL3802311)
Ki 14±n/a nM
Citation Lee, ECFutatsugi, KArcari, JTBahnck, KCoffey, SBDerksen, DRKalgutkar, ASLoria, PMSharma, R Optimization of amide-based EP3 receptor antagonists. Bioorg Med Chem Lett26:2670-5 (2016) 
 
Prostaglandin E2 receptor EP3 subtype
Name:Prostaglandin E2 receptor EP3 subtype
Type:Enzyme
Mol. Mass.:43335.03
Organism:Homo sapiens (Human)
Description:P43115
Residue:390
BDBM50166580
NameBDBM50166580
Synonyms:CHEMBL3797824
TypeSmall organic molecule
Emp. Form.C15H14ClN5OS
Mol. Mass.347.823
SMILESCCn1ncc2c(Cl)cc(cc12)C(=O)Nc1nnc(s1)C1CC1