Reaction Details
TargetD(2) dopamine receptor
LigandBDBM50166861
Substrate/Competitorn/a
Meas. Tech.ChEMBL_1572808 (CHEMBL3800738)
Ki>2000±n/a nM
Citation Fabritius, CHPesonen, UMessinger, JHorvath, RSalo, HGalezowski, MGalek, MStefanska, KSzeremeta-Spisak, JOlszak-Plachta, MBuda, AAdamczyk, JKról, MPrusis, PSieprawska-Lupa, MMikulski, MKuokkanen, KChapman, HObuchowicz, RKorjamo, TJalava, NNowak, M 1-Sulfonyl-6-Piperazinyl-7-Azaindoles as potent and pseudo-selective 5-HT6 receptor antagonists. Bioorg Med Chem Lett26:2610-5 (2016) 
 
D(2) dopamine receptor
Name:D(2) dopamine receptor
Type:Cell-surface receptors
Mol. Mass.:50647.10
Organism:Homo sapiens (Human)
Description:P14416
Residue:443
BDBM50166861
NameBDBM50166861
Synonyms:CHEMBL3799448
TypeSmall organic molecule
Emp. Form.C24H27F3N4O3S
Mol. Mass.508.556
SMILESCN1CCN(CC1)c1cc(-c2ccc(cc2)C(F)(F)F)c2ccn(c2n1)S(=O)(=O)C1CCOCC1