Reaction Details
TargetTyrosine-protein kinase JAK2
LigandBDBM50021656
Substrate/Competitorn/a
Meas. Tech.ChEMBL_1573795 (CHEMBL3803216)
IC50 7.0±n/a nM
Citation Liang, XHuang, YZang, JGao, QWang, BXu, WZhang, Y Design, synthesis and preliminary biological evaluation of 4-aminopyrazole derivatives as novel and potent JAKs inhibitors. Bioorg Med Chem24:2660-72 (2016) 
 
Tyrosine-protein kinase JAK2
Name:Tyrosine-protein kinase JAK2
Type:Protein
Mol. Mass.:130684.68
Organism:Homo sapiens (Human)
Description:O60674
Residue:1132
BDBM50021656
NameBDBM50021656
Synonyms:BARICITINIB LY-3009104 US10766894, Compound TABLE 1.19 US11203595, TABLE 1.19 US20230416237, Example baricitinib
TypeSmall organic molecule
Emp. Form.C16H17N7O2S
Mol. Mass.371.417
SMILESCCS(=O)(=O)N1CC(CC#N)(C1)n1cc(cn1)-c1ncnc2[nH]ccc12