Reaction Details
TargetKallikrein-5 [D153N]
LigandBDBM50167828
Substrate/Competitorn/a
Meas. Tech.ChEMBL_1574273 (CHEMBL3802456)
Ki 22900±n/a nM
Citation Saeed, A Isocoumarins, miraculous natural products blessed with diverse pharmacological activities. Eur J Med Chem116:290-317 (2016) 
 
Kallikrein-5 [D153N]
Name:Kallikrein-5 [D153N]
Type:PROTEIN
Mol. Mass.:32031.75
Organism:Homo sapiens (Human)
Description:ChEMBL_1282456
Residue:293
BDBM50167828
NameBDBM50167828
Synonyms:CHEMBL3798972
TypeSmall organic molecule
Emp. Form.C30H22O13
Mol. Mass.590.4879
SMILESCOC1=C(C(=O)c2c(O)c3C(=O)O[C@@H](C)Cc3c(O)c2C1=O)c1c(O)c2C(=O)C3=C(C[C@H](C)OC3=O)C(=O)c2cc1OC