Reaction Details
TargetSteryl-sulfatase
LigandBDBM50151143
Substrate/Competitorn/a
Meas. Tech.ChEMBL_1577312 (CHEMBL3808043)
IC50>530±n/a nM
Citation Shah, RSingh, JSingh, DJaggi, ASSingh, N Sulfatase inhibitors for recidivist breast cancer treatment: A chemical review. Eur J Med Chem114:170-90 (2016) 
 
Steryl-sulfatase
Name:Steryl-sulfatase
Type:Enzyme
Mol. Mass.:65503.66
Organism:Homo sapiens (Human)
Description:P08842
Residue:583
BDBM50151143
NameBDBM50151143
Synonyms:2-Adamantan-1-yl-4-oxo-4H-chromene-6-carboxylic acid amide | CHEMBL183996
TypeSmall organic molecule
Emp. Form.C20H21NO3
Mol. Mass.323.3856
SMILESNC(=O)c1ccc2oc(cc(=O)c2c1)C12CC3CC(CC(C3)C1)C2