Reaction Details
TargetSteryl-sulfatase
LigandBDBM50112876
Substrate/Competitorn/a
Meas. Tech.ChEMBL_1577319 (CHEMBL3808050)
Ki 350±n/a nM
Citation Shah, RSingh, JSingh, DJaggi, ASSingh, N Sulfatase inhibitors for recidivist breast cancer treatment: A chemical review. Eur J Med Chem114:170-90 (2016) 
 
Steryl-sulfatase
Name:Steryl-sulfatase
Type:Enzyme
Mol. Mass.:65503.66
Organism:Homo sapiens (Human)
Description:P08842
Residue:583
BDBM50112876
NameBDBM50112876
Synonyms:3-((N-cyclohexyl-aminocarbonoyl)hydrazono]methyl)-1,9,11,14-tetrahydroxy-7-methoxy-10-methyl-8,13-dioxo-5,6,8,13-tetrahydro-benzo[a]naphthacene-2-carboxylic acid | CHEMBL25794
TypeSmall organic molecule
Emp. Form.C33H31N3O10
Mol. Mass.629.6133
SMILESCOc1c2CCc3cc(C=NNC(=O)NC4CCCCC4)c(C(O)=O)c(O)c3-c2c(O)c2C(=O)c3cc(O)c(C)c(O)c3C(=O)c12