Reaction Details
TargetCyclin-C
LigandBDBM50169081
Substrate/Competitorn/a
Meas. Tech.ChEMBL_1577630 (CHEMBL3807238)
IC50 1.000000±n/a nM
Citation Koehler, MFBergeron, PBlackwood, EMBowman, KClark, KRFirestein, RKiefer, JRMaskos, KMcCleland, MLOrren, LSalphati, LSchmidt, SSchneider, EVWu, JBeresini, MH Development of a Potent, Specific CDK8 Kinase Inhibitor Which Phenocopies CDK8/19 Knockout Cells. ACS Med Chem Lett7:223-8 (2016) 
 
Cyclin-C
Name:Cyclin-C
Type:PROTEIN
Mol. Mass.:33244.88
Organism:Homo sapiens (Human)
Description:ChEMBL_107900
Residue:283
BDBM50169081
NameBDBM50169081
Synonyms:CHEMBL3806220
TypeSmall organic molecule
Emp. Form.C15H8N6OS
Mol. Mass.320.329
SMILESN#Cc1ccc(Oc2cncc3sc(cc23)-c2nnn[nH]2)cc1