Reaction Details
TargetCyclin-C
LigandBDBM50169082
Substrate/Competitorn/a
Meas. Tech.ChEMBL_1577630 (CHEMBL3807238)
IC50 1.1±n/a nM
Citation Koehler, MFBergeron, PBlackwood, EMBowman, KClark, KRFirestein, RKiefer, JRMaskos, KMcCleland, MLOrren, LSalphati, LSchmidt, SSchneider, EVWu, JBeresini, MH Development of a Potent, Specific CDK8 Kinase Inhibitor Which Phenocopies CDK8/19 Knockout Cells. ACS Med Chem Lett7:223-8 (2016) 
 
Cyclin-C
Name:Cyclin-C
Type:PROTEIN
Mol. Mass.:33244.88
Organism:Homo sapiens (Human)
Description:ChEMBL_107900
Residue:283
BDBM50169082
NameBDBM50169082
Synonyms:CHEMBL3805960
TypeSmall organic molecule
Emp. Form.C15H8F3N5O2S
Mol. Mass.379.317
SMILESFC(F)(F)Oc1ccc(Oc2cncc3sc(cc23)-c2nnn[nH]2)cc1