Reaction Details
TargetCyclin-C
LigandBDBM50265311
Substrate/Competitorn/a
Meas. Tech.ChEMBL_1577630 (CHEMBL3807238)
IC50 1.1±n/a nM
Citation Koehler, MFBergeron, PBlackwood, EMBowman, KClark, KRFirestein, RKiefer, JRMaskos, KMcCleland, MLOrren, LSalphati, LSchmidt, SSchneider, EVWu, JBeresini, MH Development of a Potent, Specific CDK8 Kinase Inhibitor Which Phenocopies CDK8/19 Knockout Cells. ACS Med Chem Lett7:223-8 (2016) 
 
Cyclin-C
Name:Cyclin-C
Type:PROTEIN
Mol. Mass.:33244.88
Organism:Homo sapiens (Human)
Description:ChEMBL_107900
Residue:283
BDBM50265311
NameBDBM50265311
Synonyms:4-(4-chlorophenoxy)-2-(2H-tetrazol-5-yl)thieno[2,3-c]pyridine | CHEMBL507453
TypeSmall organic molecule
Emp. Form.C14H8ClN5OS
Mol. Mass.329.764
SMILESClc1ccc(Oc2cncc3sc(cc23)-c2nnn[nH]2)cc1