Reaction Details
TargetHistamine H4 receptor
LigandBDBM50170147
Substrate/Competitorn/a
Meas. Tech.ChEMBL_1577389 (CHEMBL3806523)
EC50 524±n/a nM
Citation Geyer, RNordemann, UStrasser, AWittmann, HJBuschauer, A Conformational Restriction and Enantioseparation Increase Potency and Selectivity of Cyanoguanidine-Type Histamine H4 Receptor Agonists. J Med Chem59:3452-70 (2016) 
 
Histamine H4 receptor
Name:Histamine H4 receptor
Type:G Protein-Coupled Receptor (GPCR)
Mol. Mass.:44517.02
Organism:Homo sapiens (Human)
Description:Binding assays were using CHO cells stably expressing hH4R receptors.
Residue:390
BDBM50170147
NameBDBM50170147
Synonyms:CHEMBL3804862
TypeSmall organic molecule
Emp. Form.C19H24N6O
Mol. Mass.352.4335
SMILESN#C\N=C(\NCCOc1ccccc1)NC[C@H]1CC[C@@H](C1)c1c[nH]cn1