Reaction Details
TargetHistamine H3 receptor
LigandBDBM50170121
Substrate/Competitorn/a
Meas. Tech.ChEMBL_1577386 (CHEMBL3806427)
EC50 1530±n/a nM
Citation Geyer, RNordemann, UStrasser, AWittmann, HJBuschauer, A Conformational Restriction and Enantioseparation Increase Potency and Selectivity of Cyanoguanidine-Type Histamine H4 Receptor Agonists. J Med Chem59:3452-70 (2016) 
 
Histamine H3 receptor
Name:Histamine H3 receptor
Type:G Protein-Coupled Receptor (GPCR)
Mol. Mass.:48691.47
Organism:Homo sapiens (Human)
Description:Binding assays were using CHO cells stably expressing hH3R receptors.
Residue:445
BDBM50170121
NameBDBM50170121
Synonyms:CHEMBL3806146
TypeSmall organic molecule
Emp. Form.C14H20N6
Mol. Mass.272.3488
SMILESN#C\N=C(/NC[C@@H]1CC[C@@H](C1)c1c[nH]cn1)NC1CC1