Reaction Details
TargetHistamine H3 receptor
LigandBDBM50170164
Substrate/Competitorn/a
Meas. Tech.ChEMBL_1577461 (CHEMBL3806734)
Ki 4.3±n/a nM
Citation Geyer, RNordemann, UStrasser, AWittmann, HJBuschauer, A Conformational Restriction and Enantioseparation Increase Potency and Selectivity of Cyanoguanidine-Type Histamine H4 Receptor Agonists. J Med Chem59:3452-70 (2016) 
 
Histamine H3 receptor
Name:Histamine H3 receptor
Type:G Protein-Coupled Receptor (GPCR)
Mol. Mass.:48691.47
Organism:Homo sapiens (Human)
Description:Binding assays were using CHO cells stably expressing hH3R receptors.
Residue:445
BDBM50170164
NameBDBM50170164
Synonyms:Imbutamine
TypeSmall organic molecule
Emp. Form.C7H13N3
Mol. Mass.139.1982
SMILESNCCCCc1c[nH]cn1