Reaction Details
TargetAminopeptidase N
LigandBDBM50170899
Substrate/Competitorn/a
Meas. Tech.ChEMBL_1577953 (CHEMBL3806577)
Ki 41100±n/a nM
Citation Weglarz-Tomczak, EBerlicki, LPawelczak, MNocek, BJoachimiak, AMucha, A A structural insight into the P1S1 binding mode of diaminoethylphosphonic and phosphinic acids, selective inhibitors of alanine aminopeptidases. Eur J Med Chem117:187-96 (2016) 
 
Aminopeptidase N
Name:Aminopeptidase N
Type:PROTEIN
Mol. Mass.:109522.63
Organism:Homo sapiens (Human)
Description:ChEMBL_1507526
Residue:967
BDBM50170899
NameBDBM50170899
Synonyms:CHEMBL3806100
TypeSmall organic molecule
Emp. Form.C4H14N3O3P
Mol. Mass.183.146
SMILESNCCNCC(N)P(O)(O)=O