Reaction Details
TargetApelin receptor
LigandBDBM50172375
Substrate/Competitorn/a
Meas. Tech.ChEMBL_1579548 (CHEMBL3810894)
Ki 0.840000±n/a nM
Citation Murza, ASainsily, XCoquerel, DCôté, JMarx, PBesserer-Offroy, ÉLongpré, JMLainé, JReversade, BSalvail, DLeduc, RDumaine, RLesur, OAuger-Messier, MSarret, PMarsault, É Discovery and Structure-Activity Relationship of a Bioactive Fragment of ELABELA that Modulates Vascular and Cardiac Functions. J Med Chem59:2962-72 (2016) 
 
Apelin receptor
Name:Apelin receptor
Type:Enzyme Catalytic Domain
Mol. Mass.:42664.06
Organism:Homo sapiens (Human)
Description:P35414
Residue:380
BDBM50172375
NameBDBM50172375
Synonyms:CHEMBL3809149
TypeSmall organic molecule
Emp. Form.C75H119N25O17S
Mol. Mass.1674.97
SMILESCSCCC(NC(=O)C(C)NC(=O)C(CCCNC(N)=N)NC(=O)C(CCCNC(N)=N)NC(=O)C1CCC(=O)N1)C(=O)N1CCCC1C(=O)NC(CC(C)C)C(=O)NC(Cc1cnc[nH]1)C(=O)NC(CO)C(=O)NC(CCCNC(N)=N)C(=O)NC(C(C)C)C(=O)N1CCCC1C(=O)NC(Cc1ccccc1)C(=O)N1CCCC1C(O)=O