Reaction Details
TargetOxysterols receptor LXR-beta
LigandBDBM19993
Substrate/Competitorn/a
Meas. Tech.ChEMBL_1581225 (CHEMBL3811011)
EC50 20±n/a nM
Citation Stachel, SJZerbinatti, CRudd, MTCosden, MSuon, SNanda, KKWessner, KDiMuzio, JMaxwell, JWu, ZUslaner, JMMichener, MSSzczerba, PBrnardic, ERada, VKim, YMeissner, RWuelfing, PYuan, YBallard, JHolahan, MKlein, DJLu, JFradera, XParthasarathy, GUebele, VNChen, ZLi, YLi, JCooke, AJBennett, DJBilodeau, MTRenger, J Identification and in Vivo Evaluation of Liver X Receptorß-Selective Agonists for the Potential Treatment of Alzheimer's Disease. J Med Chem59:3489-98 (2016) 
 
Oxysterols receptor LXR-beta
Name:Oxysterols receptor LXR-beta
Type:Enzyme Catalytic Domain
Mol. Mass.:50978.79
Organism:Homo sapiens (Human)
Description:P55055
Residue:460
BDBM19993
NameBDBM19993
Synonyms:CHEMBL62136 T 0901317 TO-901317 US10669296, Compound TO901317 [3H]T0901317
TypeSmall organic molecule
Emp. Form.C17H12F9NO3S
Mol. Mass.481.333
SMILESOC(c1ccc(cc1)N(CC(F)(F)F)S(=O)(=O)c1ccccc1)(C(F)(F)F)C(F)(F)F