Reaction Details
TargetKallikrein-1
LigandBDBM189415
Substrate/Competitorn/a
Meas. Tech.ChEMBL_1578582 (CHEMBL3811623)
Ki 25±n/a nM
Citation Glunz, PWMueller, LCheney, DLLadziata, VZou, YWurtz, NRWei, AWong, PCWexler, RRPriestley, ES Atropisomer Control in Macrocyclic Factor VIIa Inhibitors. J Med Chem59:4007-18 (2016) 
 
Kallikrein-1
Name:Kallikrein-1
Type:Enzyme
Mol. Mass.:28874.69
Organism:Homo sapiens (Human)
Description:P06870
Residue:262
BDBM189415
NameBDBM189415
Synonyms:US9174974, Comparator 4
TypeSmall organic molecule
Emp. Form.C28H27N5O3
Mol. Mass.481.5457
SMILESC[C@H]1COC(=O)Nc2cccc(CNC(=O)C(Nc3ccc4c(N)nccc4c3)c3ccc1cc3)c2