Reaction Details
TargetCoagulation factor X
LigandBDBM50172786
Substrate/Competitorn/a
Meas. Tech.ChEMBL_1578578 (CHEMBL3811619)
Ki>13300±n/a nM
Citation Glunz, PWMueller, LCheney, DLLadziata, VZou, YWurtz, NRWei, AWong, PCWexler, RRPriestley, ES Atropisomer Control in Macrocyclic Factor VIIa Inhibitors. J Med Chem59:4007-18 (2016) 
 
Coagulation factor X
Name:Coagulation factor X
Type:Enzyme
Mol. Mass.:54726.60
Organism:Homo sapiens (Human)
Description:n/a
Residue:488
BDBM50172786
NameBDBM50172786
Synonyms:CHEMBL3809909
TypeSmall organic molecule
Emp. Form.C29H29N5O3
Mol. Mass.495.5723
SMILESCC1(C)COC(=O)Nc2cccc(CNC(=O)[C@H](Nc3ccc4c(N)nccc4c3)c3ccc1cc3)c2