Reaction Details
TargetMu-type opioid receptor
LigandBDBM50173129
Substrate/Competitorn/a
Meas. Tech.ChEMBL_1579557 (CHEMBL3810903)
Ki 15±n/a nM
Citation Guillemyn, KStarnowska, JLagard, CDyniewicz, JRojewska, EMika, JChung, NNUtard, VKosson, PLipkowski, AWChevillard, LArranz-Gibert, PTeixidó, MMegarbane, BTourwé, DSimonin, FPrzewlocka, BSchiller, PWBallet, S Bifunctional Peptide-Based Opioid Agonist-Nociceptin Antagonist Ligands for Dual Treatment of Acute and Neuropathic Pain. J Med Chem59:3777-92 (2016) 
 
Mu-type opioid receptor
Name:Mu-type opioid receptor
Type:G Protein-Coupled Receptor (GPCR)
Mol. Mass.:44789.51
Organism:Homo sapiens (Human)
Description:P35372
Residue:400
BDBM50173129
NameBDBM50173129
Synonyms:CHEMBL3810104
TypeSmall organic molecule
Emp. Form.C79H110N24O13
Mol. Mass.1603.8717
SMILESCc1cc(O)cc(C)c1C[C@H](N)C(=O)N[C@H](CCCNC(N)=N)C(=O)N[C@H]1Cc2ccccc2CN(CCC(=O)N[C@@H](CCCNC(N)=N)C(=O)N[C@@H](Cc2ccc(O)cc2)C(=O)N[C@@H](Cc2c(C)cc(O)cc2C)C(=O)N[C@@H](CCCNC(N)=N)C(=O)N[C@@H](Cc2c[nH]c3ccccc23)C(=O)N[C@@H](CCCNC(N)=N)C(N)=O)C1=O