Reaction Details
TargetNociceptin receptor
LigandBDBM50173131
Substrate/Competitorn/a
Meas. Tech.ChEMBL_1579560 (CHEMBL3810906)
Ki 39±n/a nM
Citation Guillemyn, KStarnowska, JLagard, CDyniewicz, JRojewska, EMika, JChung, NNUtard, VKosson, PLipkowski, AWChevillard, LArranz-Gibert, PTeixidó, MMegarbane, BTourwé, DSimonin, FPrzewlocka, BSchiller, PWBallet, S Bifunctional Peptide-Based Opioid Agonist-Nociceptin Antagonist Ligands for Dual Treatment of Acute and Neuropathic Pain. J Med Chem59:3777-92 (2016) 
 
Nociceptin receptor
Name:Nociceptin receptor
Type:G Protein-Coupled Receptor (GPCR)
Mol. Mass.:40702.87
Organism:Homo sapiens (Human)
Description:P41146
Residue:370
BDBM50173131
NameBDBM50173131
Synonyms:CHEMBL3810101
TypeSmall organic molecule
Emp. Form.C42H68N14O8
Mol. Mass.897.0783
SMILESCC[C@H](C)[C@H](NC(=O)[C@H](CCCNC(N)=N)NC(=O)[C@H](Cc1ccc(O)cc1)NC(=O)[C@H](Cc1ccc(O)cc1)NC(=O)[C@@H](N)CCCNC(N)=N)C(=O)N[C@@H](CCCCN)C(N)=O