Reaction Details
TargetSerine/threonine-protein kinase PLK1
LigandBDBM241235
Substrate/Competitorn/a
Meas. Tech.ChEMBL_1578605 (CHEMBL3811829)
IC50>100000±n/a nM
Citation Innocenti, PWoodward, HLSolanki, SNaud, SWestwood, IMCronin, NHayes, ARoberts, JHenley, ATBaker, RFaisal, AMak, GWBox, GValenti, MDe Haven Brandon, AO'Fee, LSaville, HSchmitt, JMatijssen, BBurke, Rvan Montfort, RLRaynaud, FIEccles, SALinardopoulos, SBlagg, JHoelder, S Rapid Discovery of Pyrido[3,4-d]pyrimidine Inhibitors of Monopolar Spindle Kinase 1 (MPS1) Using a Structure-Based Hybridization Approach. J Med Chem59:3671-88 (2016) 
 
Serine/threonine-protein kinase PLK1
Name:Serine/threonine-protein kinase PLK1
Type:Serine/threonine-protein kinase
Mol. Mass.:68277.16
Organism:Homo sapiens (Human)
Description:P53350
Residue:603
BDBM241235
NameBDBM241235
Synonyms:US10479788, Example 77 US9409907, 77
TypeSmall organic molecule
Emp. Form.C24H29N7O
Mol. Mass.431.5334
SMILESCOc1cc(ccc1Nc1ncc2ccnc(N[C@@H](C)C(C)(C)C)c2n1)-c1cnn(C)c1