Reaction Details
TargetDual specificity protein kinase TTK
LigandBDBM241196
Substrate/Competitorn/a
Meas. Tech.ChEBML_1581301
IC50>1000±n/a nM
Citation Innocenti, PWoodward, HLSolanki, SNaud, SWestwood, IMCronin, NHayes, ARoberts, JHenley, ATBaker, RFaisal, AMak, GWBox, GValenti, MDe Haven Brandon, AO'Fee, LSaville, HSchmitt, JMatijssen, BBurke, Rvan Montfort, RLRaynaud, FIEccles, SALinardopoulos, SBlagg, JHoelder, S Rapid Discovery of Pyrido[3,4-d]pyrimidine Inhibitors of Monopolar Spindle Kinase 1 (MPS1) Using a Structure-Based Hybridization Approach. J Med Chem59:3671-88 (2016) 
 
Dual specificity protein kinase TTK
Name:Dual specificity protein kinase TTK
Type:Protein
Mol. Mass.:97086.79
Organism:Homo sapiens (Human)
Description:P33981
Residue:857
BDBM241196
NameBDBM241196
Synonyms:US10479788, Example 38 US9409907, 38
TypeSmall organic molecule
Emp. Form.C22H25N7O
Mol. Mass.403.4802
SMILESCCN(CC)c1nccc2cnc(Nc3ccc(cc3OC)-c3cnn(C)c3)nc12