Reaction Details
TargetDual specificity protein kinase TTK
LigandBDBM241190
Substrate/Competitorn/a
Meas. Tech.ChEMBL_1581303 (CHEMBL3811380)
IC50 600±n/a nM
Citation Innocenti, PWoodward, HLSolanki, SNaud, SWestwood, IMCronin, NHayes, ARoberts, JHenley, ATBaker, RFaisal, AMak, GWBox, GValenti, MDe Haven Brandon, AO'Fee, LSaville, HSchmitt, JMatijssen, BBurke, Rvan Montfort, RLRaynaud, FIEccles, SALinardopoulos, SBlagg, JHoelder, S Rapid Discovery of Pyrido[3,4-d]pyrimidine Inhibitors of Monopolar Spindle Kinase 1 (MPS1) Using a Structure-Based Hybridization Approach. J Med Chem59:3671-88 (2016) 
 
Dual specificity protein kinase TTK
Name:Dual specificity protein kinase TTK
Type:Protein
Mol. Mass.:97086.79
Organism:Homo sapiens (Human)
Description:P33981
Residue:857
BDBM241190
NameBDBM241190
Synonyms:US11046688, Example 32 | US9409907, 32
TypeSmall organic molecule
Emp. Form.C22H20N8O
Mol. Mass.412.4472
SMILESCOc1cc(ccc1Nc1ncc2ccnc(-c3cnn(C)c3)c2n1)-c1cnn(C)c1