Reaction Details
TargetMucosa-associated lymphoid tissue lymphoma translocation protein 1
LigandBDBM260159
Substrate/Competitorn/a
Meas. Tech.ChEMBL_1581729 (CHEMBL3816160)
IC50 420±n/a nM
Citation Xin, BTSchimmack, GDu, YFlorea, BIvan der Marel, GADriessen, CKrappmann, DOverkleeft, HS Development of new Malt1 inhibitors and probes. Bioorg Med Chem24:3312-29 (2016) 
 
Mucosa-associated lymphoid tissue lymphoma translocation protein 1
Name:Mucosa-associated lymphoid tissue lymphoma translocation protein 1
Type:Enzyme
Mol. Mass.:92257.81
Organism:Homo sapiens (Human)
Description:Q9UDY8
Residue:824
BDBM260159
NameBDBM260159
Synonyms:BDBM50177661 | US9504692, Mepezine
TypeSmall organic molecule
Emp. Form.C19H22N2S
Mol. Mass.310.456
SMILESCN1CCCC(CN2c3ccccc3Sc3ccccc23)C1