Reaction Details
TargetMucosa-associated lymphoid tissue lymphoma translocation protein 1
LigandBDBM50133332
Substrate/Competitorn/a
Meas. Tech.ChEMBL_1581726 (CHEMBL3816059)
IC50 7762±n/a nM
Citation Xin, BTSchimmack, GDu, YFlorea, BIvan der Marel, GADriessen, CKrappmann, DOverkleeft, HS Development of new Malt1 inhibitors and probes. Bioorg Med Chem24:3312-29 (2016) 
 
Mucosa-associated lymphoid tissue lymphoma translocation protein 1
Name:Mucosa-associated lymphoid tissue lymphoma translocation protein 1
Type:Enzyme
Mol. Mass.:92257.81
Organism:Homo sapiens (Human)
Description:Q9UDY8
Residue:824
BDBM50133332
NameBDBM50133332
Synonyms:CHEMBL3183233
TypeSmall organic molecule
Emp. Form.C19H17Cl3N4O3
Mol. Mass.455.722
SMILESCOCCOc1nc(-c2ccc(Cl)c(Cl)c2)n(n1)-c1ccc(NC(=O)CCl)cc1