Reaction Details
TargetReceptor-type tyrosine-protein kinase FLT3
LigandBDBM50177715
Substrate/Competitorn/a
Meas. Tech.ChEMBL_1583399 (CHEMBL3815409)
IC50 10.0±n/a nM
Citation Hatcher, JMWeisberg, ESim, TStone, RMLiu, SGriffin, JDGray, NS Discovery of a Highly Potent and Selective Indenoindolone Type 1 Pan-FLT3 Inhibitor. ACS Med Chem Lett7:476-81 (2016) 
 
Receptor-type tyrosine-protein kinase FLT3
Name:Receptor-type tyrosine-protein kinase FLT3
Type:Enzyme
Mol. Mass.:112888.62
Organism:Homo sapiens (Human)
Description:P36888
Residue:993
BDBM50177715
NameBDBM50177715
Synonyms:CHEMBL3815054
TypeSmall organic molecule
Emp. Form.C26H24N6O
Mol. Mass.436.5084
SMILESCN(C)CCCn1cc(cn1)-c1ccc2C(=O)c3c([nH]c4cc(ccc34)-c3cn[nH]c3)-c2c1